Quick dating
Custom Menu
  • contact phone chat dating uk
  • dating lima peru
  • NEWS
    As a community of more than 40 million individual opinions and ways of experiencing the world, we are always coming up with new ways for our users to meet, go on dates, and fall in love. READ MORE Actress, Tasha Smith has impacted our world of entertainment for many years now.


    Nexus error updating group repository metadata

    Version 1.2 is compatible with Nexus Repository Manager Pro 2.3, Version 1.4.4 is compatible with Nexus Repository Manager Pro 2.4, Version 1.4.8 is compatible with Nexus Repository Manager Pro 2.5 and 2.6.1.5 and 1.6.x can be used for Nexus Repository Manager Pro 2.7 to 2.10.Because it has attracted low-quality or spam answers that had to be removed, posting an answer now requires 10 reputation on this site (the association bonus does not count).Once the repository manager is configured to receive components in the staging suite as documented in Section 11.2, “Configuring the Staging Suite”, you will have to update your project build configuration to deploy to the staging suite.The preferred way to do this is to take advantage of the features provided by the Nexus Staging Maven plugin or the Nexus Staging Ant tasks as documented in Section 11.3.1, “Deployment with the Nexus Staging Maven Plugin” and Section 11.3.2, “Deployment with the Nexus Staging Ant Tasks”.[INFO] ------------------------------------------------------------------------[INFO] BUILD FAILURE[INFO] ------------------------------------------------------------------------[INFO] Total time: 2.114s[INFO] Finished at: Wed May 15 KST 2013[INFO] Final Memory: 7M/238M[INFO] ------------------------------------------------------------------------[ERROR] Failed to execute goal org.apache.maven.plugins:maven-deploy-plugin:2.7:deploy (default-deploy) on project deploy-test: Failed to deploy artifacts: Could not transfer artifact org.example.app:deploy-test:jar:1.1 from/to tech.release (https://nexus.ktnet.com/content/repositories/com.company/): Failed to transfer file: https://nexus.company.com/content/repositories/com.ktnet/org/example/app/deploy-test/1.1/deploy-test-1.1 In this article you will learn how to write a Jenkins CI Plugin and how to use the REST API from the Sonatype Nexus repository.

    @ line 286, column 21 [WARNING] The expression $ is deprecated. [WARNING] [INFO] [INFO] ------------------------------------------------------------------------ [INFO] Building i XSystems Portal Products and Services Registration 1.0-SNAPSHOT [INFO] ------------------------------------------------------------------------ [WARNING] The POM for com.liferay.portal:util-java:jar:5.2.8 is missing, no dependency information available [WARNING] The POM for com.liferay.portal:util-bridges:jar:5.2.8 is missing, no dependency information available [WARNING] The POM for com.liferay.portal:portal-kernel:jar:5.2.8 is missing, no dependency information available [WARNING] The POM for com.liferay.portal:portal-impl:jar:5.2.8 is missing, no dependency information available [INFO] ------------------------------------------------------------------------ [INFO] BUILD FAILURE [INFO] ------------------------------------------------------------------------ [INFO] Total time: 2.063s [INFO] Finished at: Fri Jun 24 EST 2011 [INFO] Final Memory: 5M/88M [INFO] ------------------------------------------------------------------------ [ERROR] Failed to execute goal on project ixsystems-registration: Could not resolve dependencies for project ixsystems:ixsystems-registration:war:1.0-SNAPSHOT: The following artifacts could not be resolved: com.liferay.portal:util-java:jar:5.2.8, com.liferay.portal:util-bridges:jar:5.2.8, com.liferay.portal:portal-kernel:jar:5.2.8, com.liferay.portal:portal-impl:jar:5.2.8: Failure to find com.liferay.portal:util-java:jar:5.2.8 in was cached in the local repository, resolution will not be reattempted until the update interval of central has elapsed or updates are forced - [Help 1] [ERROR] [ERROR] To see the full stack trace of the errors, re-run Maven with the -e switch.

    I assume you have a working version of Maven installed as well as the Java JDK.

    This actually happens more often than you might think - there is a typo in the dependency.

    If the version referenced by the is not there you will get a 404.

    This can usually be fixed by running rebuild metadata on the affected artifact.

    Leave a Reply


    Pages: [1] 2 3 4 5 6 | Next | Last


    




    Copyright © 2017 - baltrodnik.ru